{"text_format":"1","workbook":"xlsx","n_sheets":15,"sheets":["QBDProperties","Allgemeine Projektangaben","Deckblatt","Inhalt des PPF-Berichts","Prüfergebnisse Blatt 1","Soll-Ist Vergleich","Musterauftrag","Zeichnung","Verlinkungen","MFU","Lng","Drop Down","Zukaufteile Datenblatt","Zukaufteile Tabelle","Anlage zu Werkstoff"],"not_rendered":{"charts":2,"images":2,"macros":1,"external_links":1,"defined_names":261,"comments":0,"pivot_tables":0},"unopened":[],"bounds":{"document_bytes":16777216,"sheet_cells":100000,"rows_first":2000,"rows_last":500,"rows_between":2000,"halvings":0,"cell_chars":16384,"cell_head_chars":4096},"cells_cut":0,"cells_raw":0,"read":"whole","date_system":"1900"}

{"sheet":"QBDProperties","index":0,"n_rows":174,"n_cols":1,"rows_kept":174,"cut":false,"hidden":true,"merged":[]}
["Produktsparte = ; Sprache = Deutsch; Sprache = English; Standort = "]
["---"]
["Deutsch; English"]
["---"]
["---"]
["25.01.2022"]
["--FirmenLogo--"]
["25.01.2022"]
["Gandhi, Vicky"]
["Gandhi, Vicky 25.01.2022;   "]
{"$rows_left_out":165}
{"sheet":"Allgemeine Projektangaben","index":1,"n_rows":56,"n_cols":6,"rows_kept":56,"cut":false,"hidden":false,"merged":[[0,1,0,2],[0,5,1,5]]}
[" ","Allgemeine Projektangaben  EMPB",null,null,null,"Sprache / Language"]
[]
[null,"Datum, Name (Lieferant)",null,null,null,"Deutsch"]
[null,"Datum der Freigabe (Kunde)"]
[]
[null,"Kundenangaben (allgemein)"]
[null,"Kenn-Nr. Kunde:"]
[null,"Firma (Kurzbezeichnung):"]
[null,"Firma:"]
[null,"Abteilung:"]
{"$rows_left_out":47}
{"sheet":"Deckblatt","index":2,"n_rows":71,"n_cols":44,"rows_kept":71,"cut":false,"hidden":false,"merged":[[6,1,6,26],[55,1,55,9],[56,1,56,9],[17,1,17,43],[38,13,38,19],[31,39,31,41],[31,21,31,22],[45,27,45,43],[45,23,45,26],[46,23,51,43],[49,10,49,22],[45,1,45,5],[32,11,32,22],[45,6,45,22],[51,15,51,22],[51,1,51,14],[70,1,70,3],[70,4,70,43],[31,42,31,43],[63,23,68,43],[66,10,66,22],[61,13,61,43],[62,27,62,43],[53,1,54,9],[62,23,62,26],[53,10,54,11],[53,12,53,43],[62,1,62,5],[57,1,57,9],[62,6,62,22],[68,1,68,14],[68,15,68,22],[63,1,63,5],[64,1,65,5],[63,6,63,22],[64,6,65,22],[67,1,67,10],[67,11,67,22],[47,6,48,22],[46,6,46,22],[46,1,46,5],[47,1,48,5],[50,1,50,10],[50,11,50,22]]}
[]
[]
[null,null,null,null,null,null,null,null,null,null,null,null,null,null,null,null,null,null,null,null,null,null,null,null,null,null," Bericht Produktionsprozess- und Produktfreigabe (PPF)"]
[null,null,null,null,null,null,null,null,null,null,null,null,null,null,null,null,null,null,null,null,null,null,null,null,null,null," Erstmusterprüfbericht VDA"]
[null,null,null,null,null,null,null,null,null,null,null,null,null,null,null,null,null,null,null,null,null,null,null,null,null,null,null,null," Bemusterungsgrund"]
[null,null,null,null,null,null,null,null,null,null,null,null,null,null,null,null,null,null,null,null,null,null,null,null,null,null,null,null,null,null,null," Erstbemusterung"]
[null,"   Gruner AG Bürglestr. 15-17  D-78564 Wehingen",null,null,null,null,null,null,null,null,null,null,null,null,null,null,null,null,null,null,null,null,null,null,null,null,null,null,null,null,null," Nachbemusterung"]
[null,null,null,null,null,null,null,null,null,null,null,null,null,null,null,null,null,null,null,null,null,null,null,null,null,null,null,null,null,null,null," Neuteil"]
[null,{"$f":"IF(ISBLANK('Allgemeine Projektangaben'!C8),\"\",CONCATENATE(\"  \",'Allgemeine Projektangaben'!C8))","v":""},null,null,null,null,null,null,null,null,null,null,null,null,null,null,null,null,null,null,null,null,null,null,null,null,null,null,null,null,null," Produktänderung"]
[null,{"$f":"IF(ISBLANK('Allgemeine Projektangaben'!C9),\"\",CONCATENATE(\"  \",'Allgemeine Projektangaben'!C9))","v":""},null,null,null,null,null,null,null,null,null,null,null,null,null,null,null,null,null,null,null,null,null,null,null,null,null,null,null,null,null," Produktionsverlagerung"]
{"$rows_left_out":62}
{"sheet":"Inhalt des PPF-Berichts","index":3,"n_rows":56,"n_cols":9,"rows_kept":56,"cut":false,"hidden":false,"merged":[[55,7,55,8],[16,1,16,4],[16,8,16,10],[5,1,5,4],[5,5,5,9],[16,6,16,7],[28,8,28,10],[17,8,17,10],[18,8,18,10],[19,8,19,10],[20,8,20,10],[21,8,21,10],[22,8,22,10],[23,8,23,10],[24,8,24,10],[25,8,25,10],[26,8,26,10],[27,8,27,10],[29,8,29,10],[30,8,30,10],[31,8,31,10],[32,8,32,10],[33,8,33,10],[48,8,48,10],[17,6,17,7],[18,6,18,7],[19,6,19,7],[20,6,20,7],[21,6,21,7],[22,6,22,7],[23,6,23,7],[24,6,24,7],[41,8,41,10],[42,8,42,10],[43,8,43,10],[44,8,44,10],[45,8,45,10],[46,8,46,10],[40,8,40,10],[35,6,35,7],[47,8,47,10],[34,8,34,10],[35,8,35,10],[36,8,36,10],[37,8,37,10],[38,8,38,10],[39,8,39,10],[30,6,30,7],[31,6,31,7],[32,6,32,7],[33,6,33,7],[34,6,34,7],[25,6,25,7],[26,6,26,7],[27,6,27,7],[28,6,28,7],[29,6,29,7],[50,1,50,2],[50,3,52,10],[1,4,3,10],[48,6,48,7],[37,6,37,7],[38,6,38,7],[39,6,39,7],[40,6,40,7],[41,6,41,7],[42,6,42,7],[43,6,43,7],[44,6,44,7],[45,6,45,7],[46,6,46,7],[47,6,47,7],[36,6,36,7]]}
[]
[null,null,null,null,"Inhalt des Produktionsprozess- und Produktfreigabe (PPF)"]
[]
[]
[]
[null,"Kundenangaben",null,null,null,"Lieferantenangaben"]
[]
[null,{"$f":"'Allgemeine Projektangaben'!B7&\" \"&'Allgemeine Projektangaben'!C7","v":"Kenn-Nr. Kunde: "},null,null,null,{"$f":"'Allgemeine Projektangaben'!B30&\" \"&'Allgemeine Projektangaben'!C30","v":"Kenn-Nr. Lieferant: "}]
[null,{"$f":"'Allgemeine Projektangaben'!B19&\" \"&'Allgemeine Projektangaben'!C19","v":"Prüfberichts-Nr.: "},null,null,null,{"$f":"'Allgemeine Projektangaben'!B31&\" \"&'Allgemeine Projektangaben'!C31","v":"Prüfberichts-Nr.: "}]
[null,{"$f":"'Allgemeine Projektangaben'!B20&\" \"&'Allgemeine Projektangaben'!C20","v":"Version: "},null,null,null,{"$f":"'Allgemeine Projektangaben'!B32&\" \"&'Allgemeine Projektangaben'!C32","v":"Version: "}]
{"$rows_left_out":47}
{"sheet":"Prüfergebnisse Blatt 1","index":4,"n_rows":597,"n_cols":314,"rows_kept":597,"cut":false,"hidden":false,"merged":[[596,310,596,312],[596,313,596,318],[11,14,12,14],[11,15,12,15],[283,30,283,33],[283,34,283,40],[281,30,281,33],[281,34,281,40],[43,1,43,15],[44,1,46,15],[10,5,12,5],[10,3,12,3],[0,5,2,15],[10,2,12,2],[10,1,12,1],[10,6,10,13],[10,14,10,15],[0,1,2,2],[8,8,8,15],[4,1,4,7],[5,1,5,7],[6,1,6,7],[7,1,7,7],[8,1,8,7],[6,8,6,15],[7,8,7,15],[9,1,9,15],[10,4,12,4]]}
[null,null,null,null,null,"Prüfergebnisse"]
[]
[]
[]
[null,{"$f":"'Allgemeine Projektangaben'!B30&\" \"&'Allgemeine Projektangaben'!C30","v":"Kenn-Nr. Lieferant: "},null,null,null,null,null,null,{"$f":"'Allgemeine Projektangaben'!B7&\" \"&'Allgemeine Projektangaben'!C7","v":"Kenn-Nr. Kunde: "}]
[null,{"$f":"'Allgemeine Projektangaben'!B31&\" \"&'Allgemeine Projektangaben'!C31","v":"Prüfberichts-Nr.: "},null,null,null,null,null,null,{"$f":"'Allgemeine Projektangaben'!B19&\" \"&'Allgemeine Projektangaben'!C19","v":"Prüfberichts-Nr.: "}]
[null,"Sach- / Zeichnungs- / Änderungs-Nr. / Stand / Datum / Q- Stand:",null,null,null,null,null,null,"Sach- / Zeichnungs- / Änderungs-Nr. / Stand / Datum:"]
[null,{"$f":"CONCATENATE(\"  \",'Allgemeine Projektangaben'!C38,\" / \",'Allgemeine Projektangaben'!C39,\" / \",'Allgemeine Projektangaben'!C41&\" / \",'Allgemeine Projektangaben'!C40)","v":"   /  /  / "},null,null,null,null,null,null,{"$f":"CONCATENATE(\"  \",'Allgemeine Projektangaben'!C21,\" / \",'Allgemeine Projektangaben'!C22,\" / \",'Allgemeine Projektangaben'!C24,\" / \",'Allgemeine Projektangaben'!C23)","v":"   /  /  / "}]
[null,{"$f":"'Allgemeine Projektangaben'!B42&\" \"&'Allgemeine Projektangaben'!C42","v":"Benennung: "},null,null,null,null,null,null,{"$f":"'Allgemeine Projektangaben'!B25&\" \"&'Allgemeine Projektangaben'!C25","v":"Benennung: "}]
[]
{"$rows_left_out":588}
{"sheet":"Soll-Ist Vergleich","index":5,"n_rows":212,"n_cols":22,"rows_kept":212,"cut":false,"hidden":false,"merged":[[105,0,105,1],[106,0,107,6],[105,7,105,8],[106,7,107,13],[52,0,52,1],[52,14,52,15],[52,21,52,22],[53,0,54,6],[52,7,52,8],[53,7,54,13],[53,14,54,20],[53,21,54,27],[105,14,105,15],[105,21,105,22],[106,14,107,20],[106,21,107,27],[158,21,158,22],[159,14,160,20],[159,21,160,27],[211,0,211,1],[211,7,211,8],[158,0,158,1],[158,7,158,8],[159,0,160,6],[159,7,160,13],[158,14,158,15],[212,0,213,6],[212,7,213,13],[211,14,211,15],[211,21,211,22],[212,14,213,20],[212,21,213,27]]}
[]
[]
[]
[]
[]
[]
[]
[]
[]
[]
{"$rows_left_out":203}
{"sheet":"Musterauftrag","index":6,"n_rows":0,"n_cols":0,"rows_kept":0,"cut":false,"hidden":true,"merged":[]}

{"sheet":"Zeichnung","index":7,"n_rows":0,"n_cols":0,"rows_kept":0,"cut":false,"hidden":false,"merged":[]}

{"sheet":"Verlinkungen","index":8,"n_rows":2,"n_cols":4,"rows_kept":2,"cut":false,"hidden":true,"merged":[]}
[]
[null,"Materialnummer","Bezeichnung","Link"]

{"sheet":"MFU","index":9,"n_rows":589,"n_cols":314,"rows_kept":589,"cut":false,"hidden":false,"merged":[[588,313,588,318],[20,10,20,12],[13,15,13,18],[25,10,25,12],[26,10,26,12],[27,10,27,12],[16,10,16,12],[16,13,31,18],[588,310,588,312],[17,10,17,12],[13,9,13,10],[13,11,13,12],[13,13,13,14],[18,7,18,9],[10,1,10,4],[7,16,7,18],[5,14,5,18],[5,10,5,13],[29,10,29,12],[25,7,25,9],[9,5,9,9],[9,10,9,11],[23,7,24,9],[26,7,26,9],[27,7,27,9],[16,7,16,9],[11,1,11,18],[13,2,14,2],[13,3,14,3],[13,4,14,4],[13,5,14,5],[13,6,14,6],[13,7,13,8],[30,10,30,12],[276,1,276,2],[31,10,31,12],[28,10,28,12],[20,7,20,9],[22,7,22,9],[22,10,22,12],[21,10,21,11],[21,7,21,8],[17,7,17,9],[23,10,24,12],[277,1,277,2],[278,1,278,2],[280,1,280,2],[28,7,28,9],[29,7,29,9],[30,7,30,9],[31,7,31,9],[8,10,8,12],[8,13,8,15],[18,10,18,12],[19,7,19,9],[19,10,19,12],[9,12,9,14],[14,15,15,18],[14,7,15,8],[14,9,15,10],[14,11,15,12],[14,13,15,14],[5,5,5,8],[6,5,6,8],[9,1,9,4],[0,2,0,15],[1,5,4,12],[5,1,5,4],[6,10,6,13],[6,14,6,18],[6,1,6,4],[1,13,2,18],[7,1,7,4],[7,5,7,9],[7,10,7,12],[7,13,7,15],[8,1,8,4],[8,5,8,9]]}
[]
[null,null,null,null,null,"Fähigkeitsanalyse",null,null,null,null,null,null,null,"Prozessfähigkeit"]
[]
[]
[]
[null,"Material Nr.",null,null,null,"Zeichnungs-Nr.:",null,null,null,"Rev.","Prüfmittel",null,null,null,"Prüfer"]
[]
[null,"Benennung",null,null,null,"Charge Nr.",null,null,null,null,"Abteilung",null,null,"Durchwahl",null,null,"Datum"]
[]
[null,"Graue Felder nicht ausfüllen\n",null,null,null,"Änderungsnr.",null,null,null,null,null,null,"Kavitäten & Kennzeichnung"]
{"$rows_left_out":580}
{"sheet":"Lng","index":10,"n_rows":613,"n_cols":20,"rows_kept":613,"cut":false,"hidden":true,"merged":[[283,6,315,6],[316,6,348,6],[349,6,381,6],[382,6,414,6],[415,6,447,6],[448,6,480,6],[481,6,513,6],[514,6,546,6],[547,6,579,6],[580,6,612,6],[183,6,202,6],[203,6,222,6],[223,6,242,6],[243,6,262,6],[263,6,282,6]]}
["Sheet","multipage","Column","Row","DE","EN","Nr.","Tabellenblattnamen",null,null,"Prüfergebnisse",null,"MFU"]
["Allgemeine Projektangaben",0,"B",1,"Allgemeine Projektangaben  EMPB","General project information ISIR",{"$f":"IF(H2=\"\",\"\",ROW()-1)","v":""},{"$f":"IFERROR(MID(INDEX(Listsheets,ROW(A1)),FIND(\"]\",INDEX(Listsheets,ROW(A1)))+1,31),\"\")","v":""},null,{"$f":"IF(H2=\"\",\"\",\"2\")","v":""},{"$f":"IF(H2=\"\",\"\",IFERROR(SMALL(IF(IFERROR(SEARCH($K$1,$H$1:$H$232)>0,FALSE),ROW($H$1:$H$232)),ROW()-1),\"\"))","v":""},{"$f":"IF(H2=\"\",\"\",IFERROR(INDEX($G$1:$L$39,K2,J2),\"\"))","v":""},{"$f":"IF(H2=\"\",\"\",IFERROR(SMALL(IF(IFERROR(SEARCH($M$1,$H$1:$H$232)>0,FALSE),ROW($H$1:$H$232)),ROW()-1),\"\"))","v":""},{"$f":"IF(H2=\"\",\"\",IFERROR(INDEX($G$1:$L$39,M2,J2),\"\"))","v":""},null,null,{"$f":"IF(INDIRECT(\"'\"&H2&\"'!LB597\")=0,\"\",INDIRECT(\"'\"&H2&\"'!LB597\"))","v":{"$error":"#REF!"}},{"$f":"IF(INDIRECT(\"'\"&H2&\"'!LB589\")=0,\"\",INDIRECT(\"'\"&H2&\"'!LB589\"))","v":{"$error":"#REF!"}},{"$f":"IFERROR(IF(ROWS(S$2:S2)>COUNTA($Q$2:$Q$20),\"\",INDEX($Q$2:$Q$20,_xlfn.AGGREGATE(15,6,(ROW($Q$2:$Q$20)-ROW($Q$2)+1)/($Q$2:$Q$20<>\"\"),ROWS(S$2:S2)))),\"\")","v":""},{"$f":"IFERROR(IF(ROWS(T$2:T2)>COUNTA($R$2:$R$20),\"\",INDEX($R$2:$R$20,_xlfn.AGGREGATE(15,6,(ROW($R$2:$R$20)-ROW($R$2)+1)/($R$2:$R$20<>\"\"),ROWS(T$2:T2)))),\"\")","v":""}]
["Allgemeine Projektangaben",0,"B",3,"Datum, Name (Lieferant)","Date, Name (supplier)","",{"$f":"IFERROR(MID(INDEX(Listsheets,ROW(A2)),FIND(\"]\",INDEX(Listsheets,ROW(A2)))+1,31),\"\")","v":""},null,"",{"$f":"IF(H3=\"\",\"\",IFERROR(SMALL(IF(IFERROR(SEARCH($K$1,$H$1:$H$232)>0,FALSE),ROW($H$1:$H$232)),ROW()-1),\"\"))","v":""},"",{"$f":"IF(H3=\"\",\"\",IFERROR(SMALL(IF(IFERROR(SEARCH($M$1,$H$1:$H$232)>0,FALSE),ROW($H$1:$H$232)),ROW()-1),\"\"))","v":""},{"$f":"IF(H3=\"\",\"\",IFERROR(INDEX($G$1:$L$39,M3,J3),\"\"))","v":""},null,null,{"$f":"IF(INDIRECT(\"'\"&H3&\"'!LB597\")=0,\"\",INDIRECT(\"'\"&H3&\"'!LB597\"))","v":{"$error":"#REF!"}},{"$f":"IF(INDIRECT(\"'\"&H3&\"'!LB589\")=0,\"\",INDIRECT(\"'\"&H3&\"'!LB589\"))","v":{"$error":"#REF!"}},{"$f":"IFERROR(IF(ROWS(S$2:S3)>COUNTA($Q$2:$Q$20),\"\",INDEX($Q$2:$Q$20,_xlfn.AGGREGATE(15,6,(ROW($Q$2:$Q$20)-ROW($Q$2)+1)/($Q$2:$Q$20<>\"\"),ROWS(S$2:S3)))),\"\")","v":""},{"$f":"IFERROR(IF(ROWS(T$2:T3)>COUNTA($R$2:$R$20),\"\",INDEX($R$2:$R$20,_xlfn.AGGREGATE(15,6,(ROW($R$2:$R$20)-ROW($R$2)+1)/($R$2:$R$20<>\"\"),ROWS(T$2:T3)))),\"\")","v":""}]
["Allgemeine Projektangaben",0,"B",4,"Datum der Freigabe (Kunde)","Release date (customer)","",{"$f":"IFERROR(MID(INDEX(Listsheets,ROW(A3)),FIND(\"]\",INDEX(Listsheets,ROW(A3)))+1,31),\"\")","v":""},null,"",{"$f":"IF(H4=\"\",\"\",IFERROR(SMALL(IF(IFERROR(SEARCH($K$1,$H$1:$H$232)>0,FALSE),ROW($H$1:$H$232)),ROW()-1),\"\"))","v":""},"",{"$f":"IF(H4=\"\",\"\",IFERROR(SMALL(IF(IFERROR(SEARCH($M$1,$H$1:$H$232)>0,FALSE),ROW($H$1:$H$232)),ROW()-1),\"\"))","v":""},"",null,null,{"$f":"IF(INDIRECT(\"'\"&H4&\"'!LB597\")=0,\"\",INDIRECT(\"'\"&H4&\"'!LB597\"))","v":{"$error":"#REF!"}},{"$f":"IF(INDIRECT(\"'\"&H4&\"'!LB589\")=0,\"\",INDIRECT(\"'\"&H4&\"'!LB589\"))","v":{"$error":"#REF!"}},{"$f":"IFERROR(IF(ROWS(S$2:S4)>COUNTA($Q$2:$Q$20),\"\",INDEX($Q$2:$Q$20,_xlfn.AGGREGATE(15,6,(ROW($Q$2:$Q$20)-ROW($Q$2)+1)/($Q$2:$Q$20<>\"\"),ROWS(S$2:S4)))),\"\")","v":""},{"$f":"IFERROR(IF(ROWS(T$2:T4)>COUNTA($R$2:$R$20),\"\",INDEX($R$2:$R$20,_xlfn.AGGREGATE(15,6,(ROW($R$2:$R$20)-ROW($R$2)+1)/($R$2:$R$20<>\"\"),ROWS(T$2:T4)))),\"\")","v":""}]
["Allgemeine Projektangaben",0,"B",6,"Kundenangaben (allgemein)","Customer information (general)","",{"$f":"IFERROR(MID(INDEX(Listsheets,ROW(A4)),FIND(\"]\",INDEX(Listsheets,ROW(A4)))+1,31),\"\")","v":""},null,"",{"$f":"IF(H5=\"\",\"\",IFERROR(SMALL(IF(IFERROR(SEARCH($K$1,$H$1:$H$232)>0,FALSE),ROW($H$1:$H$232)),ROW()-1),\"\"))","v":""},"",{"$f":"IF(H5=\"\",\"\",IFERROR(SMALL(IF(IFERROR(SEARCH($M$1,$H$1:$H$232)>0,FALSE),ROW($H$1:$H$232)),ROW()-1),\"\"))","v":""},"",null,null,{"$f":"IF(INDIRECT(\"'\"&H5&\"'!LB597\")=0,\"\",INDIRECT(\"'\"&H5&\"'!LB597\"))","v":{"$error":"#REF!"}},{"$f":"IF(INDIRECT(\"'\"&H5&\"'!LB589\")=0,\"\",INDIRECT(\"'\"&H5&\"'!LB589\"))","v":{"$error":"#REF!"}},{"$f":"IFERROR(IF(ROWS(S$2:S5)>COUNTA($Q$2:$Q$20),\"\",INDEX($Q$2:$Q$20,_xlfn.AGGREGATE(15,6,(ROW($Q$2:$Q$20)-ROW($Q$2)+1)/($Q$2:$Q$20<>\"\"),ROWS(S$2:S5)))),\"\")","v":""},{"$f":"IFERROR(IF(ROWS(T$2:T5)>COUNTA($R$2:$R$20),\"\",INDEX($R$2:$R$20,_xlfn.AGGREGATE(15,6,(ROW($R$2:$R$20)-ROW($R$2)+1)/($R$2:$R$20<>\"\"),ROWS(T$2:T5)))),\"\")","v":""}]
["Allgemeine Projektangaben",0,"B",7,"Kenn-Nr. Kunde:","Customer identification no.:","",{"$f":"IFERROR(MID(INDEX(Listsheets,ROW(A5)),FIND(\"]\",INDEX(Listsheets,ROW(A5)))+1,31),\"\")","v":""},null,"",{"$f":"IF(H6=\"\",\"\",IFERROR(SMALL(IF(IFERROR(SEARCH($K$1,$H$1:$H$232)>0,FALSE),ROW($H$1:$H$232)),ROW()-1),\"\"))","v":""},"",{"$f":"IF(H6=\"\",\"\",IFERROR(SMALL(IF(IFERROR(SEARCH($M$1,$H$1:$H$232)>0,FALSE),ROW($H$1:$H$232)),ROW()-1),\"\"))","v":""},"",null,null,{"$f":"IF(INDIRECT(\"'\"&H6&\"'!LB597\")=0,\"\",INDIRECT(\"'\"&H6&\"'!LB597\"))","v":{"$error":"#REF!"}},{"$f":"IF(INDIRECT(\"'\"&H6&\"'!LB589\")=0,\"\",INDIRECT(\"'\"&H6&\"'!LB589\"))","v":{"$error":"#REF!"}},{"$f":"IFERROR(IF(ROWS(S$2:S6)>COUNTA($Q$2:$Q$20),\"\",INDEX($Q$2:$Q$20,_xlfn.AGGREGATE(15,6,(ROW($Q$2:$Q$20)-ROW($Q$2)+1)/($Q$2:$Q$20<>\"\"),ROWS(S$2:S6)))),\"\")","v":""},{"$f":"IFERROR(IF(ROWS(T$2:T6)>COUNTA($R$2:$R$20),\"\",INDEX($R$2:$R$20,_xlfn.AGGREGATE(15,6,(ROW($R$2:$R$20)-ROW($R$2)+1)/($R$2:$R$20<>\"\"),ROWS(T$2:T6)))),\"\")","v":""}]
["Allgemeine Projektangaben",0,"B",8,"Firma (Kurzbezeichnung):","Company (short name):","",{"$f":"IFERROR(MID(INDEX(Listsheets,ROW(A6)),FIND(\"]\",INDEX(Listsheets,ROW(A6)))+1,31),\"\")","v":""},null,"",{"$f":"IF(H7=\"\",\"\",IFERROR(SMALL(IF(IFERROR(SEARCH($K$1,$H$1:$H$232)>0,FALSE),ROW($H$1:$H$232)),ROW()-1),\"\"))","v":""},"",{"$f":"IF(H7=\"\",\"\",IFERROR(SMALL(IF(IFERROR(SEARCH($M$1,$H$1:$H$232)>0,FALSE),ROW($H$1:$H$232)),ROW()-1),\"\"))","v":""},"",null,null,{"$f":"IF(INDIRECT(\"'\"&H7&\"'!LB597\")=0,\"\",INDIRECT(\"'\"&H7&\"'!LB597\"))","v":{"$error":"#REF!"}},{"$f":"IF(INDIRECT(\"'\"&H7&\"'!LB589\")=0,\"\",INDIRECT(\"'\"&H7&\"'!LB589\"))","v":{"$error":"#REF!"}},{"$f":"IFERROR(IF(ROWS(S$2:S7)>COUNTA($Q$2:$Q$20),\"\",INDEX($Q$2:$Q$20,_xlfn.AGGREGATE(15,6,(ROW($Q$2:$Q$20)-ROW($Q$2)+1)/($Q$2:$Q$20<>\"\"),ROWS(S$2:S7)))),\"\")","v":""},{"$f":"IFERROR(IF(ROWS(T$2:T7)>COUNTA($R$2:$R$20),\"\",INDEX($R$2:$R$20,_xlfn.AGGREGATE(15,6,(ROW($R$2:$R$20)-ROW($R$2)+1)/($R$2:$R$20<>\"\"),ROWS(T$2:T7)))),\"\")","v":""}]
["Allgemeine Projektangaben",0,"B",9,"Firma:","Company:","",{"$f":"IFERROR(MID(INDEX(Listsheets,ROW(A7)),FIND(\"]\",INDEX(Listsheets,ROW(A7)))+1,31),\"\")","v":""},null,"",{"$f":"IF(H8=\"\",\"\",IFERROR(SMALL(IF(IFERROR(SEARCH($K$1,$H$1:$H$232)>0,FALSE),ROW($H$1:$H$232)),ROW()-1),\"\"))","v":""},"",{"$f":"IF(H8=\"\",\"\",IFERROR(SMALL(IF(IFERROR(SEARCH($M$1,$H$1:$H$232)>0,FALSE),ROW($H$1:$H$232)),ROW()-1),\"\"))","v":""},"",null,null,{"$f":"IF(INDIRECT(\"'\"&H8&\"'!LB597\")=0,\"\",INDIRECT(\"'\"&H8&\"'!LB597\"))","v":{"$error":"#REF!"}},{"$f":"IF(INDIRECT(\"'\"&H8&\"'!LB589\")=0,\"\",INDIRECT(\"'\"&H8&\"'!LB589\"))","v":{"$error":"#REF!"}},{"$f":"IFERROR(IF(ROWS(S$2:S8)>COUNTA($Q$2:$Q$20),\"\",INDEX($Q$2:$Q$20,_xlfn.AGGREGATE(15,6,(ROW($Q$2:$Q$20)-ROW($Q$2)+1)/($Q$2:$Q$20<>\"\"),ROWS(S$2:S8)))),\"\")","v":""},{"$f":"IFERROR(IF(ROWS(T$2:T8)>COUNTA($R$2:$R$20),\"\",INDEX($R$2:$R$20,_xlfn.AGGREGATE(15,6,(ROW($R$2:$R$20)-ROW($R$2)+1)/($R$2:$R$20<>\"\"),ROWS(T$2:T8)))),\"\")","v":""}]
["Allgemeine Projektangaben",0,"B",10,"Abteilung:","Department:","",{"$f":"IFERROR(MID(INDEX(Listsheets,ROW(A8)),FIND(\"]\",INDEX(Listsheets,ROW(A8)))+1,31),\"\")","v":""},null,"",{"$f":"IF(H9=\"\",\"\",IFERROR(SMALL(IF(IFERROR(SEARCH($K$1,$H$1:$H$232)>0,FALSE),ROW($H$1:$H$232)),ROW()-1),\"\"))","v":""},"",{"$f":"IF(H9=\"\",\"\",IFERROR(SMALL(IF(IFERROR(SEARCH($M$1,$H$1:$H$232)>0,FALSE),ROW($H$1:$H$232)),ROW()-1),\"\"))","v":""},"",null,null,{"$f":"IF(INDIRECT(\"'\"&H9&\"'!LB597\")=0,\"\",INDIRECT(\"'\"&H9&\"'!LB597\"))","v":{"$error":"#REF!"}},{"$f":"IF(INDIRECT(\"'\"&H9&\"'!LB589\")=0,\"\",INDIRECT(\"'\"&H9&\"'!LB589\"))","v":{"$error":"#REF!"}},{"$f":"IFERROR(IF(ROWS(S$2:S9)>COUNTA($Q$2:$Q$20),\"\",INDEX($Q$2:$Q$20,_xlfn.AGGREGATE(15,6,(ROW($Q$2:$Q$20)-ROW($Q$2)+1)/($Q$2:$Q$20<>\"\"),ROWS(S$2:S9)))),\"\")","v":""},{"$f":"IFERROR(IF(ROWS(T$2:T9)>COUNTA($R$2:$R$20),\"\",INDEX($R$2:$R$20,_xlfn.AGGREGATE(15,6,(ROW($R$2:$R$20)-ROW($R$2)+1)/($R$2:$R$20<>\"\"),ROWS(T$2:T9)))),\"\")","v":""}]
["Allgemeine Projektangaben",0,"B",11,"Name:","Name:","",{"$f":"IFERROR(MID(INDEX(Listsheets,ROW(A9)),FIND(\"]\",INDEX(Listsheets,ROW(A9)))+1,31),\"\")","v":""},null,"",{"$f":"IF(H10=\"\",\"\",IFERROR(SMALL(IF(IFERROR(SEARCH($K$1,$H$1:$H$232)>0,FALSE),ROW($H$1:$H$232)),ROW()-1),\"\"))","v":""},"",{"$f":"IF(H10=\"\",\"\",IFERROR(SMALL(IF(IFERROR(SEARCH($M$1,$H$1:$H$232)>0,FALSE),ROW($H$1:$H$232)),ROW()-1),\"\"))","v":""},"",null,null,{"$f":"IF(INDIRECT(\"'\"&H10&\"'!LB597\")=0,\"\",INDIRECT(\"'\"&H10&\"'!LB597\"))","v":{"$error":"#REF!"}},{"$f":"IF(INDIRECT(\"'\"&H10&\"'!LB589\")=0,\"\",INDIRECT(\"'\"&H10&\"'!LB589\"))","v":{"$error":"#REF!"}},{"$f":"IFERROR(IF(ROWS(S$2:S10)>COUNTA($Q$2:$Q$20),\"\",INDEX($Q$2:$Q$20,_xlfn.AGGREGATE(15,6,(ROW($Q$2:$Q$20)-ROW($Q$2)+1)/($Q$2:$Q$20<>\"\"),ROWS(S$2:S10)))),\"\")","v":""},{"$f":"IFERROR(IF(ROWS(T$2:T10)>COUNTA($R$2:$R$20),\"\",INDEX($R$2:$R$20,_xlfn.AGGREGATE(15,6,(ROW($R$2:$R$20)-ROW($R$2)+1)/($R$2:$R$20<>\"\"),ROWS(T$2:T10)))),\"\")","v":""}]
{"$rows_left_out":604}
{"sheet":"Drop Down","index":11,"n_rows":13,"n_cols":5,"rows_kept":13,"cut":false,"hidden":true,"merged":[]}
[null,null,null,"Bitte geben Sie hier neue Prüfmittel ein, damit diese in der Dropdown-Option im Prüfergebnis Blatt zur Verfügung stehen. \n\nPlease enter new test equipment here to make it available in the drop-down option in the Inspection  results worksheet"]
[null,"Entscheidung",null,"Prüfmittel"]
[null,"I.O.",null,"BMS","Mügelmessschraube"]
[null,"?",null,"MES","Messschieber"]
[null,"Prozess-Optimierung",null,"KEY","Keyence"]
[null,"ZA",null,"MU","Messuhr"]
[null,"WK",null,"visuell"]
[null,null,null,"KMG"]
[null,null,null,"Wenzel"]
[null,null,null,"OMM"]
{"$rows_left_out":4}
{"sheet":"Zukaufteile Datenblatt","index":12,"n_rows":52,"n_cols":7,"rows_kept":52,"cut":false,"hidden":false,"merged":[[44,4,44,6],[49,3,49,6]]}
[null,"1. Firmen- und Produktbezeichnung"]
[]
[null," 1.1 Angaben zum Herstellen/Lieferanten",null,null,null,"1.2 Angabe zum Produkt"]
[]
[null," Name:",null,null,null,"Bauteil:"]
[null," Straße/Postfach:",null,null,null,"Musterbericht-Nr. "]
[null," Nat.-Kennz./PLZ/Ort:",null,null,null,"ZSB-Nr.:"]
[null," Lieferanten-Nummer:",null,null,null,"Bestell-Nr.:"]
[null," Ansprechpartner mit",null,null,null,"ArtikelNr.:"]
[null," Telefon/Telefax:",null,null,null,"     "]
{"$rows_left_out":43}
{"sheet":"Zukaufteile Tabelle","index":13,"n_rows":8,"n_cols":8,"rows_kept":8,"cut":false,"hidden":false,"merged":[[0,0,0,7],[2,0,2,7],[4,3,4,4],[5,3,5,4],[4,5,4,6],[5,5,5,6]]}
["Stoffe, die einem gesetzlichen Anwendungsverbot unterliegen, dürfen nicht enthalten sein! Es müssen auch Gefahrensoffe angegeben werden, die bei Gebrauch entstehen oder freigesetzt werden können. "]
[]
["Beachte: VDA-Liste für deklarationspflichtige Stoffe! "]
[]
["3. Teilecharakterisierung:",null,"ZSB-Nr.:",null,null," Musterbericht-Nr.: VDA "]
[null,null,"Bennenung:",null,null," "]
[]
["Teile-Nr./ Werkstoff-Nr.","Teilebezeichnung","ZSB-Komponente","Masse [g]","Material/ Herstellerbezogene Produktbezeichnung","Inhaltsstoffe CAS-Nr.","Inhaltsstoffe Stoffbezeichnung","Gehalt [%]"]

{"sheet":"Anlage zu Werkstoff","index":14,"n_rows":17,"n_cols":6,"rows_kept":17,"cut":false,"hidden":false,"merged":[[15,1,16,4],[1,3,1,4],[0,3,0,4],[3,2,3,3],[3,4,3,5]]}
[null,null,"Sach-Nr.",null,null,"Kunden-Nr."]
[null,null,null,"Anlage zu Werkstoff-EMPB-Kunststoffe"]
[]
[null,null,"POS.",null,"POS."]
[null,"PRÜFPARAMETER","SOLL","IST","SOLL","IST"]
[null,"Teile - Benennung"]
[null,"Werkstoff - Hersteller"]
[null,"Werkstoff-Bezeichnung"]
[null,"Dichte"]
[null,"Schmelzbereich / Glasübergangtemperatur"]
{"$rows_left_out":7}